Target
Potassium voltage-gated channel subfamily H member 2
Ligand
BDBM50178699
Substrate
Meas. Tech.
ChEMBL_1583749 (CHEMBL3815836)
IC50
21000±n/a nM
Citation
 Jiang, JFinlay, HJohnson, JAHarikrishnan, LKamau, MQiao, JWang, TAdam, LTaylor, DYang, RSleph, PChen, AYAYin, XWexler, RSalvati, ME Discovery of hydroxyl 1,2-diphenylethanamine analogs as potent cholesterol ester transfer protein inhibitors. Bioorg Med Chem Lett 26:3278-3281 (2016)  
Target
Name:
Potassium voltage-gated channel subfamily H member 2
Synonyms:
1,3-beta-glucan synthase component GLS2 ERG Eag-related protein 1 Ether-a-go-go-related gene (HERG) Ether-a-go-go-related gene potassium channel 1 Ether-a-go-go-related gene potassium channel 1 (hERG1) Ether-a-go-go-related protein 1 H-ERG KCNH2 Potassium voltage-gated channel subfamily H member 2 (hERG) Voltage-gated potassium channel subunit Kv11.1 hERG Potassium Channel 1 | putative potassium channel subunit
Type:
Multi-pass membrane protein
Mol. Mass.:
126672.65
Organism:
Homo sapiens (Human)
Description:
Q12809
Residue:
1159
  
Inhibitor
Name:
BDBM50178699
Synonyms:
CHEMBL3813836
Type:
Small organic molecule
Emp. Form.:
C28H26F9NO3
Mol. Mass.:
595.4966
SMILES:
CC(C)Oc1cc(ccc1F)[C@@](Cc1ccccc1)(NC[C@@H](O)C(F)(F)F)c1cc(F)cc(OC(F)(F)C(F)F)c1
: