Target
C-C chemokine receptor type 9
Ligand
BDBM50178712
Substrate
Meas. Tech.
ChEMBL_1583874 (CHEMBL3815306)
IC50
36±n/a nM
Citation
 Pandya, BABaber, CChan, AChamberlain, BChandonnet, HGoss, JHopper, TLippa, BPoutsiaka, KRomero, JStucka, SVaroglu, MZhang, JZhang, X Discovery of indole inhibitors of chemokine receptor 9 (CCR9). Bioorg Med Chem Lett 26:3322-3325 (2016)  
Target
Name:
C-C chemokine receptor type 9
Synonyms:
CCR9 GPR28
Type:
PROTEIN
Mol. Mass.:
42023.90
Organism:
Homo sapiens (Human)
Description:
ChEMBL_1510356
Residue:
369
  
Inhibitor
Name:
BDBM50178712
Synonyms:
CHEMBL3813888
Type:
Small organic molecule
Emp. Form.:
C20H20BrNO2
Mol. Mass.:
386.282
SMILES:
CC(C)(C)c1ccc(Cn2c(cc3ccc(Br)cc23)C(O)=O)cc1
: