Target
Neuromedin-K receptor
Ligand
BDBM50180193
Substrate
Meas. Tech.
ChEMBL_1583336 (CHEMBL3816399)
IC50
1.6±n/a nM
Citation
 Yamamoto, KOkazaki, SOhno, HMatsuda, FOhkura, SMaeda, KFujii, NOishi, S Development of novel NK3 receptor antagonists with reduced environmental impact. Bioorg Med Chem 24:3494-500 (2016)  
Target
Name:
Neuromedin-K receptor
Synonyms:
NK-3 receptor NK3R NKR Neurokinin B receptor Neuromedin-3 receptor (NK-3R) Neuromedin-K receptor Neuromedin-K receptor (NK3) TAC3R Tachykinin receptor 3 | Tachykinin receptor 3 (NK3)
Type:
Enzyme
Mol. Mass.:
52221.96
Organism:
Homo sapiens (Human)
Description:
P29371
Residue:
465
  
Inhibitor
Name:
BDBM50180193
Synonyms:
AZD-2624 | AZD2624
Type:
Small organic molecule
Emp. Form.:
C26H25N3O3S
Mol. Mass.:
459.56
SMILES:
CC[C@H](NC(=O)c1c(NS(C)(=O)=O)c(nc2ccccc12)-c1ccccc1)c1ccccc1
: