Target
Prostaglandin G/H synthase 2
Ligand
BDBM50180633
Substrate
Meas. Tech.
ChEMBL_1583860 (CHEMBL3815292)
IC50
700±n/a nM
Citation
 Abdel-Aziz, AAAbou-Zeid, LAElTahir, KEMohamed, MAAbu El-Enin, MAEl-Azab, AS Design, synthesis of 2,3-disubstitued 4(3H)-quinazolinone derivatives as anti-inflammatory and analgesic agents: COX-1/2 inhibitory activities and molecular docking studies. Bioorg Med Chem 24:3818-28 (2016)  
Target
Name:
Prostaglandin G/H synthase 2
Synonyms:
COX2 Cyclooxygenase-2 (COX-2) PTGS2 Prostaglandin G/H synthase (cyclooxygenase)
Type:
Protein
Mol. Mass.:
68976.98
Organism:
Ovis aries (Sheep)
Description:
Residue:
603
  
Inhibitor
Name:
BDBM50180633
Synonyms:
CHEMBL3814898
Type:
Small organic molecule
Emp. Form.:
C27H28N4O5S
Mol. Mass.:
520.6
SMILES:
COc1cc(NC(=O)CCSc2nc3ccccc3c(=O)n2CCc2ccccn2)cc(OC)c1OC
: