Target
Dual specificity mitogen-activated protein kinase kinase 1
Ligand
BDBM50180838
Substrate
Meas. Tech.
ChEMBL_1584574 (CHEMBL3820565)
IC50
0.007150±n/a nM
Citation
 Van Dort, MEHong, HWang, HNino, CALombardi, RLBlanks, AEGalbán, SRoss, BD Discovery of Bifunctional Oncogenic Target Inhibitors against Allosteric Mitogen-Activated Protein Kinase (MEK1) and Phosphatidylinositol 3-Kinase (PI3K). J Med Chem 59:2512-22 (2016)  
Target
Name:
Dual specificity mitogen-activated protein kinase kinase 1
Synonyms:
Dual specificity mitogen-activated protein kinase (MEK) Dual specificity mitogen-activated protein kinase kinase 1 (MEK1) Dual specificity mitogen-activated protein kinase kinase MEK1/2 MAP kinase kinase 1 MAPK/ERK kinase 1 MEK-1 MP2K1_HUMAN PRKMK1 | VHL-MAP2K1/MAP2K2
Type:
Other Protein Type
Mol. Mass.:
43439.03
Organism:
Homo sapiens (Human)
Description:
Full-length human MEK-1 was generated by PCR and purified as a fusion protein from Escherichia coli lysates.
Residue:
393
  
Inhibitor
Name:
BDBM50180838
Synonyms:
CHEMBL3818606
Type:
Small organic molecule
Emp. Form.:
C15H13F3IN3O2
Mol. Mass.:
451.1823
SMILES:
NCCONC(=O)c1ccc(F)c(F)c1Nc1ccc(I)cc1F
: