Target
2-amino-4-hydroxy-6-hydroxymethyldihydropteridine diphosphokinase
Ligand
BDBM50181541
Substrate
Meas. Tech.
ChEBML_1585631
Kd
1930±n/a nM
Citation
 Dennis, MLPitcher, NPLee, MDDeBono, AJWang, ZCHarjani, JRRahmani, RCleary, BPeat, TSBaell, JBSwarbrick, JD Structural Basis for the Selective Binding of Inhibitors to 6-Hydroxymethyl-7,8-dihydropterin Pyrophosphokinase from Staphylococcus aureus and Escherichia coli. J Med Chem 59:5248-63 (2016)  
Target
Name:
2-amino-4-hydroxy-6-hydroxymethyldihydropteridine diphosphokinase
Synonyms:
2-amino-4-hydroxy-6-hydroxymethyldihydropteridin e pyrophosphokinase ABW28_08200 ABW30_08355 ABW32_09260 CH51_02625 EP54_02575 ERS157365_02703 ERS157367_02647 ERS157369_02716 ERS157371_02678 ERS157373_02672 ERS157376_02631 ERS157380_02607 ERS157382_02566 ERS157384_02627 ERS157386_02628 ERS157388_02574 ERS157390_02577 ERS157393_01767 ERS157395_02575 ERS195389_02625 ERS234133_02777 ERS365740_02669 ERS365747_02604 ERS365749_02735 ERS365755_02434 ERS365763_02601 ERS365767_02653 ERS365775_02734 ERS365784_02589 ERS365790_02581 ERS365794_02498 ERS365796_02534 ERS365805_02596 ERS365809_02622 ERS365815_02596 ERS365820_02706 ERS365822_02635 ERS365826_02612 ERS365828_02722 ERS365831_02708 ERS409806_02728 ERS410207_02669 ERS410239_02551 ERS410284_02638 ERS410300_02722 ERS410318_02753 ERS410334_02577 ERS410365_02721 ERS410378_02510 ERS410380_02657 ERS410387_02709 ERS410395_02618 ERS410402_02654 ERS410412_02583 ERS410418_02700 ERS410427_02722 ERS410449_02701 ERS410451_02621 ERS410566_02502 ERS410589_02516 ERS410613_02617 ERS410629_02511 ERS410677_02575 ERS410708_02707 ERS410740_02709 ERS410748_02665 ERS410756_02718 ERS410771_02672 ERS410787_02651 ERS410796_02576 ERS410811_02699 ERS410840_02680 ERS410863_02689 ERS410868_02674 ERS410876_02690 ERS410890_02761 ERS410898_02677 ERS410903_02744 ERS410907_02605 ERS410915_02761 ERS410929_02635 ERS410938_02439 ERS410946_02654 ERS410949_02663 ERS410955_02671 ERS410962_02660 ERS410970_02653 ERS410985_02645 ERS410994_02631 ERS411001_02682 ERS411009_02715 ERS411017_02652 ERS411020_02662 ERS411112_02700 ERS411126_02634 ERS411132_02630 ERS411140_02449 ERS411142_02472 ERS411149_02786 ERS411157_02682 ERS411165_02457 ERS411168_02695 ERS411172_02631 ERS411176_02653 ERS411184_02575 ERS411189_02635 ERS411199_02671 ERS411204_02646 ERS411207_02697 ERS411213_02650 ERS432061_02723 ERS432077_02651 ERS432093_02732 ERS432139_02644 ERS432195_02663 ERS432204_02526 ERS445052_00036 RK62_03755 RK64_03025 RK66_15440 RK69_06320 RK71_07250 RK76_09445 RK82_13545 RK86_04470 RK91_06295 RK93_05480 RL00_08220 RL02_06325 RL07_15690 TM61_02105 | folK
Type:
PROTEIN
Mol. Mass.:
18024.64
Organism:
Staphylococcus aureus
Description:
ChEMBL_109736
Residue:
158
  
Inhibitor
Name:
BDBM50181541
Synonyms:
CHEMBL3817986
Type:
Small organic molecule
Emp. Form.:
C13H10F3N5OS
Mol. Mass.:
341.312
SMILES:
Nc1nc2[nH]c(SCc3ccc(cc3)C(F)(F)F)nc2c(=O)[nH]1
: