Target
Adenosine receptor A2a
Ligand
BDBM81818
Substrate
Meas. Tech.
ChEMBL_1584152 (CHEMBL3821344)
IC50
5100±n/a nM
Citation
 Massink, ALouvel, JAdlere, Ivan Veen, CHuisman, BJDijksteel, GSGuo, DLenselink, EBBuckley, BJMatthews, HRanson, MKelso, MIJzerman, AP 5'-Substituted Amiloride Derivatives as Allosteric Modulators Binding in the Sodium Ion Pocket of the Adenosine A2A Receptor. J Med Chem 59:4769-77 (2016)  
Target
Name:
Adenosine receptor A2a
Synonyms:
A2A adenosine receptor (hA2A) ADENOSINE A2 ADORA2 Adenosine A2A receptor (A2AAR)
Type:
G Protein-Coupled Receptor (GPCR)
Mol. Mass.:
44716.46
Organism:
Homo sapiens (Human)
Description:
P29274
Residue:
412
  
Inhibitor
Name:
BDBM81818
Synonyms:
CAS_1794 HMA | NSC_1794
Type:
Small organic molecule
Emp. Form.:
C12H18ClN7O
Mol. Mass.:
311.771
SMILES:
NC(=N)NC(=O)c1nc(Cl)c(nc1N)N1CCCCCC1
: