Target
Carbonic anhydrase 12
Ligand
BDBM50092612
Substrate
Meas. Tech.
ChEMBL_1586608 (CHEMBL3821963)
Ki
0.790000±n/a nM
Citation
 Mujumdar, PTeruya, KTonissen, KFVullo, DSupuran, CTPeat, TSPoulsen, SA An Unusual Natural Product Primary Sulfonamide: Synthesis, Carbonic Anhydrase Inhibition, and Protein X-ray Structures of Psammaplin C. J Med Chem 59:5462-70 (2016)  
Target
Name:
Carbonic anhydrase 12
Synonyms:
CA-XII CAH12_HUMAN Carbonic anhydrase Carbonic anhydrase XII Carbonic anhydrase XII (CAXII) | Tumor antigen HOM-RCC-3.1.3
Type:
Enzyme
Mol. Mass.:
39456.00
Organism:
Homo sapiens (Human)
Description:
Catalytic domain of human cloned isozyme was used in the assay
Residue:
354
  
Inhibitor
Name:
BDBM50092612
Synonyms:
CHEMBL3586274
Type:
Small organic molecule
Emp. Form.:
C11H14BrN3O5S
Mol. Mass.:
380.215
SMILES:
NS(=O)(=O)CCNC(=O)C(\Cc1ccc(O)c(Br)c1)=N\O
: