Target
D(2) dopamine receptor
Ligand
BDBM50183261
Substrate
Meas. Tech.
ChEMBL_1586230 (CHEMBL3820048)
Ki
763±n/a nM
Citation
 Etukala, JRZhu, XYEyunni, SVOnyameh, EKOfori, EBricker, BAKang, HJHuang, XPRoth, BLAblordeppey, SY Development of CNS multi-receptor ligands: Modification of known D2 pharmacophores. Bioorg Med Chem 24:3671-9 (2016)  
Target
Name:
D(2) dopamine receptor
Synonyms:
D(2) dopamine receptor DOPAMINE D2 Long DRD2 Dopamine D2 receptor Dopamine D2 receptor (D2R) Dopamine2-like | d2
Type:
Cell-surface receptors
Mol. Mass.:
50647.10
Organism:
Homo sapiens (Human)
Description:
P14416
Residue:
443
  
Inhibitor
Name:
BDBM50183261
Synonyms:
CHEMBL3819642
Type:
Small organic molecule
Emp. Form.:
C21H24Cl2N2OS
Mol. Mass.:
423.399
SMILES:
Cl.OC1(CCN(CCCc2nc3ccccc3s2)CC1)c1ccc(Cl)cc1
: