Target
2-5A-dependent ribonuclease
Ligand
BDBM50183267
Substrate
Meas. Tech.
ChEMBL_1586256 (CHEMBL3820074)
EC50
0.450000±n/a nM
Citation
 Kitamura, YKito, SNakashima, RTanaka, KNagaoka, KKitade, Y Doxifluridine-conjugated 2-5A analog shows strong RNase L activation ability and tumor suppressive effect. Bioorg Med Chem 24:3870-4 (2016)  
Target
Name:
2-5A-dependent ribonuclease
Synonyms:
2-5A-dependent RNase RN5A_HUMAN RNS4 Ribonuclease 4 | Ribonuclease L
Type:
PROTEIN
Mol. Mass.:
83534.35
Organism:
Homo sapiens (Human)
Description:
ChEMBL_164152
Residue:
741
  
Inhibitor
Name:
BDBM50183267
Synonyms:
CHEMBL3817920
Type:
Small organic molecule
Emp. Form.:
C40H49FN17O23P3
Mol. Mass.:
1247.8368
SMILES:
C[C@H]1O[C@H]([C@H](OP(O)(=O)OC[C@H]2O[C@H]([C@H](OP(O)(=O)OC[C@H]3O[C@H]([C@H](OP(O)(=O)OC[C@H]4O[C@H]([C@H](O)[C@@H]4O)n4c(C)nc5c(N)ncnc45)[C@@H]3O)n3cnc4c(N)ncnc34)[C@@H]2O)n2cnc3c(N)ncnc23)[C@@H]1O)n1cc(F)c(=O)[nH]c1=O
: