Target
Delta-type opioid receptor
Ligand
BDBM50185309
Substrate
Meas. Tech.
ChEMBL_1587711 (CHEMBL3825891)
EC50
8.1±n/a nM
Citation
 Harland, AABender, AMGriggs, NWGao, CAnand, JPPogozheva, IDTraynor, JRJutkiewicz, EMMosberg, HI Effects of N-Substitutions on the Tetrahydroquinoline (THQ) Core of Mixed-Efficacyµ-Opioid Receptor (MOR)/d-Opioid Receptor (DOR) Ligands. J Med Chem 59:4985-98 (2016)  
Target
Name:
Delta-type opioid receptor
Synonyms:
Cytochrome P450 3A4 Delta opioid receptor Delta-type opioid receptor (DOR) OPRD_RAT Opioid receptor Opioid receptors; mu & delta Ror-a | Voltage-gated potassium channel
Type:
G Protein-Coupled Receptor (GPCR)
Mol. Mass.:
40465.04
Organism:
Rattus norvegicus (rat)
Description:
Competition binding assays were using CHO-K1 cell membranes expressing the opioid receptor.
Residue:
372
  
Inhibitor
Name:
BDBM50185309
Synonyms:
CHEMBL3824052
Type:
Small organic molecule
Emp. Form.:
C31H37N3O3
Mol. Mass.:
499.6438
SMILES:
CCCC(=O)N1CC[C@@H](NC(=O)[C@@H](N)Cc2c(C)cc(O)cc2C)c2cc(Cc3ccccc3)ccc12
: