Target
Muscarinic acetylcholine receptor M1
Ligand
BDBM50185422
Substrate
Meas. Tech.
ChEMBL_1588017 (CHEMBL3824952)
EC50
>10000±n/a nM
Citation
 Panarese, JDCho, HPAdams, JJNance, KDGarcia-Barrantes, PMChang, SMorrison, RDBlobaum, ALNiswender, CMStauffer, SRConn, PJLindsley, CW Further optimization of the M1 PAM VU0453595: Discovery of novel heterobicyclic core motifs with improved CNS penetration. Bioorg Med Chem Lett 26:3822-5 (2016)  
Target
Name:
Muscarinic acetylcholine receptor M1
Synonyms:
ACM1_HUMAN Cholinergic receptor, muscarinic 1 | Cholinergic, muscarinic M1
Type:
Protein
Mol. Mass.:
51442.54
Organism:
Homo sapiens (Human)
Description:
P11229
Residue:
460
  
Inhibitor
Name:
BDBM50185422
Synonyms:
CHEMBL3822763
Type:
Small organic molecule
Emp. Form.:
C23H16F2N4O
Mol. Mass.:
402.3961
SMILES:
Cn1cc2c(cccc2n1)-c1cc(F)c(Cn2cnc3ccccc3c2=O)c(F)c1
: