Target
Acetylcholinesterase
Ligand
BDBM50011780
Substrate
Meas. Tech.
ChEMBL_1589688 (CHEMBL3829843)
Kd
25720±n/a nM
Citation
 Karade, HNRaviraju, GAcharya, BNValiveti, AKBhalerao, UAcharya, J Synthesis and in vitro reactivation study of isonicotinamide derivatives of 2-(hydroxyimino)-N-(pyridin-3-yl)acetamide as reactivators of Sarin and VX inhibited human acetylcholinesterase (hAChE). Bioorg Med Chem 24:4171-4176 (2016)  
Target
Name:
Acetylcholinesterase
Synonyms:
ACES_HUMAN Acetylcholinesterase (AChE) | Acetylcholinesterase (human AChE)
Type:
Enzyme
Mol. Mass.:
67792.70
Organism:
Homo sapiens (Human)
Description:
P22303
Residue:
614
  
Inhibitor
Name:
BDBM50011780
Synonyms:
2-[(E)-(hydroxyimino)methyl]-1-methylpyridinium chloride PRALIDOXIME Pralidoxine chloride
Type:
Small organic molecule
Emp. Form.:
C7H9N2O
Mol. Mass.:
137.1586
SMILES:
C[n+]1ccccc1CN=O
: