Target
Fatty acid-binding protein, adipocyte
Ligand
BDBM50187494
Substrate
Meas. Tech.
ChEMBL_1589882 (CHEMBL3830762)
Ki
3600±n/a nM
Citation
 Zhou, YNie, TZhang, YSong, MLi, KDing, MDing, KWu, DXu, Y The discovery of novel and selective fatty acid binding protein 4 inhibitors by virtual screening and biological evaluation. Bioorg Med Chem 24:4310-4317 (2016)  
Target
Name:
Fatty acid-binding protein, adipocyte
Synonyms:
A-FABP ALBP FABP4 Fatty acid binding protein adipocyte Fatty acid-binding protein 4 (FABP4)
Type:
Enzyme
Mol. Mass.:
14719.23
Organism:
Homo sapiens (Human)
Description:
P15090
Residue:
132
  
Inhibitor
Name:
BDBM50187494
Synonyms:
CHEMBL3827401
Type:
Small organic molecule
Emp. Form.:
C23H19N3O3S
Mol. Mass.:
417.48
SMILES:
Cc1ccc(cc1C)\N=C1\NC(=O)\C(S1)=C\c1cccn1-c1cccc(c1)C(O)=O
: