Target
Fatty acid-binding protein, adipocyte
Ligand
BDBM50187488
Substrate
Meas. Tech.
ChEMBL_1589884 (CHEMBL3830764)
Kd
2650±n/a nM
Citation
 Zhou, YNie, TZhang, YSong, MLi, KDing, MDing, KWu, DXu, Y The discovery of novel and selective fatty acid binding protein 4 inhibitors by virtual screening and biological evaluation. Bioorg Med Chem 24:4310-4317 (2016)  
Target
Name:
Fatty acid-binding protein, adipocyte
Synonyms:
A-FABP ALBP FABP4 Fatty acid binding protein adipocyte Fatty acid-binding protein 4 (FABP4)
Type:
Enzyme
Mol. Mass.:
14719.23
Organism:
Homo sapiens (Human)
Description:
P15090
Residue:
132
  
Inhibitor
Name:
BDBM50187488
Synonyms:
CHEMBL3828508
Type:
Small organic molecule
Emp. Form.:
C19H18BrNO2
Mol. Mass.:
372.256
SMILES:
OC(=O)C1C2CC=CC2c2cc(Br)cc3C4C=CCC4CN1c23
: