Target
Ectonucleotide pyrophosphatase/phosphodiesterase family member 2
Ligand
BDBM50187694
Substrate
Meas. Tech.
ChEMBL_1591119 (CHEMBL3829087)
Ki
270±n/a nM
Citation
 Castagna, DBudd, DCMacdonald, SJJamieson, CWatson, AJ Development of Autotaxin Inhibitors: An Overview of the Patent and Primary Literature. J Med Chem 59:5604-21 (2016)  
Target
Name:
Ectonucleotide pyrophosphatase/phosphodiesterase family member 2
Synonyms:
ATX Autotaxin (ATX) ENPP2 Ectonucleotide Pyrophosphatase/Phosphodiesterase 2 (ENPP2) Extracellular lysophospholipase D PDNP2
Type:
Enzyme
Mol. Mass.:
99007.13
Organism:
Homo sapiens (Human)
Description:
Q13822
Residue:
863
  
Inhibitor
Name:
BDBM50187694
Synonyms:
CHEMBL3828165
Type:
Small organic molecule
Emp. Form.:
C21H37O3P
Mol. Mass.:
368.4904
SMILES:
CCCCCCCCCCCCCCc1ccc(CP(O)(O)=O)cc1
: