Target
Histone deacetylase 2
Ligand
BDBM29589
Substrate
Meas. Tech.
ChEMBL_1590563 (CHEMBL3829032)
IC50
3.3±n/a nM
Citation
 Chen, YWang, XXiang, WHe, LTang, MWang, FWang, TYang, ZYi, YWang, HNiu, TZheng, LLei, LLi, XSong, HChen, L Development of Purine-Based Hydroxamic Acid Derivatives: Potent Histone Deacetylase Inhibitors with Marked in Vitro and in Vivo Antitumor Activities. J Med Chem 59:5488-504 (2016)  
Target
Name:
Histone deacetylase 2
Synonyms:
Cereblon/Histone deacetylase 2 HDAC2 Histone deacetylase 2 (HDAC2) | Human HDAC2
Type:
Chromatin regulator; hydrolase; repressor
Mol. Mass.:
55356.54
Organism:
Homo sapiens (Human)
Description:
Q92769
Residue:
488
  
Inhibitor
Name:
BDBM29589
Synonyms:
Faridak LBH-589B US10722597, Compound Panobinostat
Type:
Small organic molecule
Emp. Form.:
C21H23N3O2
Mol. Mass.:
349.4262
SMILES:
Cc1[nH]c2ccccc2c1CCNCc1ccc(\C=C\C(=O)NO)cc1
: