Target
Toll-like receptor 7
Ligand
BDBM50189288
Substrate
Meas. Tech.
ChEMBL_1591133 (CHEMBL3829203)
EC50
570±n/a nM
Citation
 Cortez, ALi, YMiller, ATZhang, XYue, KMaginnis, JHampton, JHall, de SShapiro, MNayak, BD'Oro, ULi, CSkibinski, DMbow, MLSingh, MO'Hagan, DTCooke, MPValiante, NMWu, TY Incorporation of Phosphonate into Benzonaphthyridine Toll-like Receptor 7 Agonists for Adsorption to Aluminum Hydroxide. J Med Chem 59:5868-78 (2016)  
Target
Name:
Toll-like receptor 7
Synonyms:
TLR7_MOUSE | Tlr7
Type:
PROTEIN
Mol. Mass.:
121844.65
Organism:
Mus musculus
Description:
ChEMBL_933765
Residue:
1050
  
Inhibitor
Name:
BDBM50189288
Synonyms:
CHEMBL3828701 | US9597326, Compound 12
Type:
Small organic molecule
Emp. Form.:
C24H23FN3O4P
Mol. Mass.:
467.4293
SMILES:
COc1ccc(CCc2cnc3c(N)nc4cc(\C=C(/F)P(O)(O)=O)ccc4c3c2)c(C)c1
: