Target
Toll-like receptor 7
Ligand
BDBM50189284
Substrate
Meas. Tech.
ChEMBL_1591133 (CHEMBL3829203)
EC50
3600±n/a nM
Citation
 Cortez, ALi, YMiller, ATZhang, XYue, KMaginnis, JHampton, JHall, de SShapiro, MNayak, BD'Oro, ULi, CSkibinski, DMbow, MLSingh, MO'Hagan, DTCooke, MPValiante, NMWu, TY Incorporation of Phosphonate into Benzonaphthyridine Toll-like Receptor 7 Agonists for Adsorption to Aluminum Hydroxide. J Med Chem 59:5868-78 (2016)  
Target
Name:
Toll-like receptor 7
Synonyms:
TLR7_MOUSE | Tlr7
Type:
PROTEIN
Mol. Mass.:
121844.65
Organism:
Mus musculus
Description:
ChEMBL_933765
Residue:
1050
  
Inhibitor
Name:
BDBM50189284
Synonyms:
CHEMBL3828386 | US9597326, Compound 27
Type:
Small organic molecule
Emp. Form.:
C28H34N3O6P
Mol. Mass.:
539.5598
SMILES:
Cc1ccc2c(c1)nc(N)c1ncc(CCc3ccc(OCCOCCOCCP(O)(O)=O)cc3C)cc21
: