Target
Suppressor of tumorigenicity 14 protein
Ligand
BDBM50189311
Substrate
Meas. Tech.
ChEMBL_1591179 (CHEMBL3829339)
Ki
2280±n/a nM
Citation
 Beckmann, AMGilberg, EGattner, SHuang, TLVanden Eynde, JJMayence, ABajorath, JStirnberg, MGütschow, M Evaluation of bisbenzamidines as inhibitors for matriptase-2. Bioorg Med Chem Lett 26:3741-5 (2016)  
Target
Name:
Suppressor of tumorigenicity 14 protein
Synonyms:
Epithin MT-SP1 PRSS14 SNC19 ST14_HUMAN Suppressor of tumorigenicity 14 protein TADG15
Type:
Single-pass type II membrane protein
Mol. Mass.:
94769.23
Organism:
Homo sapiens (Human)
Description:
Q9Y5Y6
Residue:
855
  
Inhibitor
Name:
BDBM50189311
Synonyms:
4,4''-(1,2-Phenylenebis(Methylene))Bis(Oxy)Dibenzimidamide | CHEMBL181480
Type:
Small organic molecule
Emp. Form.:
C22H22N4O2
Mol. Mass.:
374.4357
SMILES:
NC(=N)c1ccc(OCc2ccccc2COc2ccc(cc2)C(N)=N)cc1
: