Target
Transmembrane protease serine 6
Ligand
BDBM50189311
Substrate
Meas. Tech.
ChEMBL_1591272 (CHEMBL3829805)
Ki
5200±n/a nM
Citation
 Beckmann, AMGilberg, EGattner, SHuang, TLVanden Eynde, JJMayence, ABajorath, JStirnberg, MGütschow, M Evaluation of bisbenzamidines as inhibitors for matriptase-2. Bioorg Med Chem Lett 26:3741-5 (2016)  
Target
Name:
Transmembrane protease serine 6
Synonyms:
Matriptase-2 TMPS6_HUMAN
Type:
PROTEIN
Mol. Mass.:
90001.12
Organism:
Homo sapiens (Human)
Description:
ChEMBL_1442547
Residue:
811
  
Inhibitor
Name:
BDBM50189311
Synonyms:
4,4''-(1,2-Phenylenebis(Methylene))Bis(Oxy)Dibenzimidamide | CHEMBL181480
Type:
Small organic molecule
Emp. Form.:
C22H22N4O2
Mol. Mass.:
374.4357
SMILES:
NC(=N)c1ccc(OCc2ccccc2COc2ccc(cc2)C(N)=N)cc1
: