Target
Trypsin
Ligand
BDBM50189311
Substrate
Meas. Tech.
ChEMBL_1591275 (CHEMBL3829808)
Ki
221±n/a nM
Citation
 Beckmann, AMGilberg, EGattner, SHuang, TLVanden Eynde, JJMayence, ABajorath, JStirnberg, MGütschow, M Evaluation of bisbenzamidines as inhibitors for matriptase-2. Bioorg Med Chem Lett 26:3741-5 (2016)  
Target
Name:
Trypsin
Synonyms:
Serine protease 1/Trypsin-2/Trypsin-3
Type:
Mol. Mass.:
Description:
ASSAY_ID of ChEMBL is 2155713
Components:
This complex has 3 components.
Component 1
Name:
Serine protease 1
Synonyms:
Alpha-trypsin chain 1 Beta-trypsin PRSS1 TRP1 TRY1_HUMAN Thrombin & trypsin Trypsin I | Trypsin-1
Type:
Enzyme
Mol. Mass.:
26557.80
Organism:
Homo sapiens (Human)
Description:
P07477
Residue:
247
  
Component 2
Name:
Trypsin-2
Synonyms:
Anionic trypsinogen Serine protease 2 TRY2_HUMAN Thrombin & trypsin Trypsin II | Trypsin-2
Type:
PROTEIN
Mol. Mass.:
26479.43
Organism:
Homo sapiens (Human)
Description:
ChEMBL_41517
Residue:
247
  
Component 3
Name:
Trypsin-3
Synonyms:
Brain trypsinogen PRSS3 Serine protease 3 TRY3 TRY4 Trypsin Trypsin IV | Trypsin-3
Type:
PROTEIN
Mol. Mass.:
32532.52
Organism:
Homo sapiens (Human)
Description:
ChEMBL_216043
Residue:
304
  
Inhibitor
Name:
BDBM50189311
Synonyms:
4,4''-(1,2-Phenylenebis(Methylene))Bis(Oxy)Dibenzimidamide | CHEMBL181480
Type:
Small organic molecule
Emp. Form.:
C22H22N4O2
Mol. Mass.:
374.4357
SMILES:
NC(=N)c1ccc(OCc2ccccc2COc2ccc(cc2)C(N)=N)cc1
: