Target
Histone deacetylase 1
Ligand
BDBM50189911
Substrate
Meas. Tech.
ChEMBL_1590996 (CHEMBL3830868)
Ki
176±n/a nM
Citation
 Wagner, FFWeïwer, MSteinbacher, SSchomburg, AReinemer, PGale, JPCampbell, AJFisher, SLZhao, WNReis, SAHennig, KMThomas, MMüller, PJefson, MRFass, DMHaggarty, SJZhang, YLHolson, EB Kinetic and structural insights into the binding of histone deacetylase 1 and 2 (HDAC1, 2) inhibitors. Bioorg Med Chem 24:4008-4015 (2016)  
Target
Name:
Histone deacetylase 1
Synonyms:
Cereblon/Histone deacetylase 1 HDAC1 Histone deacetylase 1 (HDAC1) RPD3L1
Type:
Enzyme
Mol. Mass.:
55090.27
Organism:
Homo sapiens (Human)
Description:
Q13547
Residue:
482
  
Inhibitor
Name:
BDBM50189911
Synonyms:
CHEMBL3827611
Type:
Small organic molecule
Emp. Form.:
C20H21FN2O2
Mol. Mass.:
340.3913
SMILES:
[H][C@]12CC[C@]([H])(C[C@H](C1)C(=O)Nc1cc(ccc1N)-c1ccc(F)cc1)O2
: