Target
Histone deacetylase 2
Ligand
BDBM50189908
Substrate
Meas. Tech.
ChEMBL_1591001 (CHEMBL3830979)
IC50
119±n/a nM
Citation
 Wagner, FFWeïwer, MSteinbacher, SSchomburg, AReinemer, PGale, JPCampbell, AJFisher, SLZhao, WNReis, SAHennig, KMThomas, MMüller, PJefson, MRFass, DMHaggarty, SJZhang, YLHolson, EB Kinetic and structural insights into the binding of histone deacetylase 1 and 2 (HDAC1, 2) inhibitors. Bioorg Med Chem 24:4008-4015 (2016)  
Target
Name:
Histone deacetylase 2
Synonyms:
Cereblon/Histone deacetylase 2 HDAC2 Histone deacetylase 2 (HDAC2) | Human HDAC2
Type:
Chromatin regulator; hydrolase; repressor
Mol. Mass.:
55356.54
Organism:
Homo sapiens (Human)
Description:
Q92769
Residue:
488
  
Inhibitor
Name:
BDBM50189908
Synonyms:
CHEMBL3827993
Type:
Small organic molecule
Emp. Form.:
C22H19FN2O2
Mol. Mass.:
362.3969
SMILES:
Nc1ccc(cc1NC(=O)C1Cc2ccccc2CO1)-c1ccc(F)cc1
: