Target
5'-AMP-activated protein kinase catalytic subunit alpha-1/subunit beta-2/subunit gamma-1
Ligand
BDBM237920
Substrate
Meas. Tech.
ChEMBL_1612902 (CHEMBL3854702)
EC50
>40000±n/a nM
Citation
 Cameron, KOKung, DWKalgutkar, ASKurumbail, RGMiller, RSalatto, CTWard, JWithka, JMBhattacharya, SKBoehm, MBorzilleri, KABrown, JACalabrese, MCaspers, NLCokorinos, EConn, ELDowling, MSEdmonds, DJEng, HFernando, DPFrisbie, RHepworth, DLandro, JMao, YRajamohan, FReyes, ARRose, CRRyder, TShavnya, ASmith, ACTu, MWolford, ACXiao, J Discovery and Preclinical Characterization of 6-Chloro-5-[4-(1-hydroxycyclobutyl)phenyl]-1H-indole-3-carboxylic Acid (PF-06409577), a Direct Activator of Adenosine Monophosphate-activated Protein Kinase (AMPK), for the Potential Treatment of Diabetic Nephropathy. J Med Chem 59:8068-81 (2016)  
Target
Name:
5'-AMP-activated protein kinase catalytic subunit alpha-1/subunit beta-2/subunit gamma-1
Synonyms:
AMPK alpha1/beta2/gamma1
Type:
Mol. Mass.:
Description:
ASSAY_ID of ChEMBL is 1576586
Components:
This complex has 3 components.
Component 1
Name:
5'-AMP-activated protein kinase subunit beta-2
Synonyms:
AAKB2_HUMAN AMPK subunit beta-2 | PRKAB2
Type:
PROTEIN
Mol. Mass.:
30301.35
Organism:
Homo sapiens (Human)
Description:
ChEMBL_107883
Residue:
272
  
Component 2
Name:
5'-AMP-activated protein kinase subunit gamma-1
Synonyms:
5'-AMP-activated protein kinase subunit gamma-1 AMP-activated protein kinase, gamma-1 subunit AMPK gamma-1 AMPK subunit gamma-1 PRKAG1
Type:
Mol. Mass.:
37581.44
Organism:
Homo sapiens (Human)
Description:
P54619
Residue:
331
  
Component 3
Name:
5'-AMP-activated protein kinase catalytic subunit alpha-1
Synonyms:
AAPK1_HUMAN AMP-activated protein kinase alpha-1/beta-2/gamma-2 AMPK subunit alpha-1 AMPK1 PRKAA1 | Tau-protein kinase PRKAA1
Type:
Protein
Mol. Mass.:
64023.62
Organism:
Homo sapiens (Human)
Description:
Q13131
Residue:
559
  
Inhibitor
Name:
BDBM237920
Synonyms:
US9394285, 1
Type:
Small organic molecule
Emp. Form.:
C19H16ClNO3
Mol. Mass.:
341.788
SMILES:
OC(=O)c1c[nH]c2cc(Cl)c(cc12)-c1ccc(cc1)C1(O)CCC1
: