Target
Cytochrome P450 2C9
Ligand
BDBM50192762
Substrate
Meas. Tech.
ChEMBL_1613613 (CHEMBL3855413)
IC50
2110±n/a nM
Citation
 Tice, CMNoto, PBFan, KYZhao, WLotesta, SDDong, CMarcus, APZheng, YJChen, GWu, ZVan Orden, RZhou, JBukhtiyarov, YZhao, YLipinski, KHoward, LGuo, JKandpal, GMeng, SHardy, AKrosky, PGregg, RELeftheris, KMcKeever, BMSingh, SBLala, DMcGeehan, GMZhuang, LClaremon, DA Brain penetrant liver X receptor (LXR) modulators based on a 2,4,5,6-tetrahydropyrrolo[3,4-c]pyrazole core. Bioorg Med Chem Lett 26:5044-5050 (2016)  
Target
Name:
Cytochrome P450 2C9
Synonyms:
(R)-limonene 6-monooxygenase CP2C9_HUMAN CYP2C9 Cytochrome P450 2C9 (CYP2C9 ) P-450MP P450 PB-1 | S-mephenytoin 4-hydroxylase
Type:
Enzyme
Mol. Mass.:
55636.33
Organism:
Homo sapiens (Human)
Description:
P11712
Residue:
490
  
Inhibitor
Name:
BDBM50192762
Synonyms:
CHEMBL3959681
Type:
Small organic molecule
Emp. Form.:
C20H20F3N5O2S
Mol. Mass.:
451.465
SMILES:
CC(C)[C@H]1N(Cc2cn(nc12)-c1cccc(c1)S(C)(=O)=O)c1nccc(n1)C(F)(F)F
: