Target
Coagulation factor VII/Tissue factor
Ligand
BDBM50192767
Substrate
Meas. Tech.
ChEMBL_1613695 (CHEMBL3855495)
Ki
0.220000±n/a nM
Citation
 Ladziata, VUGlunz, PWZou, YZhang, XJiang, WJacutin-Porte, SCheney, DLWei, ALuettgen, JMHarper, TMWong, PCSeiffert, DWexler, RRPriestley, ES Synthesis and P1' SAR exploration of potent macrocyclic tissue factor-factor VIIa inhibitors. Bioorg Med Chem Lett 26:5051-5057 (2016)  
Target
Name:
Coagulation factor VII/Tissue factor
Synonyms:
Coagulation factor III/Factor VIIa (fVIIa) | Coagulation factor III/VII
Type:
Mol. Mass.:
Description:
ASSAY_ID of EBI is 69535
Components:
This complex has 2 components.
Component 1
Name:
Tissue factor
Synonyms:
CD_antigen=CD142 Coagulation factor VII/tissue factor TF Thromboplastin | Tissue factor
Type:
PROTEIN
Mol. Mass.:
33067.61
Organism:
Homo sapiens (Human)
Description:
ChEMBL_936735
Residue:
295
  
Component 2
Name:
Coagulation factor VII
Synonyms:
Eptacog alfa FA7_HUMAN Factor VIIa (fVIIa) SPCA serum prothrombin conversion accelerator
Type:
Enzyme
Mol. Mass.:
51599.89
Organism:
Homo sapiens (Human)
Description:
Residue:
466
  
Inhibitor
Name:
BDBM50192767
Synonyms:
CHEMBL3984725
Type:
Small organic molecule
Emp. Form.:
C36H38FN5O5
Mol. Mass.:
639.7158
SMILES:
C[C@H]1COC(=O)Nc2ccc(c(CN(C)C(=O)[C@H](Nc3ccc4c(N)ncc(F)c4c3)c3ccc1c(C)c3)c2)C1(CCCC1)C(O)=O
: