Target
Aurora kinase A
Ligand
BDBM50193017
Substrate
Meas. Tech.
ChEMBL_1614096 (CHEMBL3855896)
IC50
2.1±n/a nM
Citation
 Ferguson, FMNi, JZhang, TTesar, BSim, TKim, NDDeng, XBrown, JRZhao, JJGray, NS Discovery of a Series of 5,11-Dihydro-6 ACS Med Chem Lett 7:908-912 (2016)  
Target
Name:
Aurora kinase A
Synonyms:
AIK ARK1 AURKA AYK1 Aurora kinase A (AURA) Aurora kinase A (Aurora A) Aurora-related kinase 1 BTAK Breast-tumor-amplified kinase STK15 Serine/threonine kinase 15 Serine/threonine-protein kinase aurora A hARK1
Type:
Serine/threonine-protein kinase
Mol. Mass.:
45830.98
Organism:
Homo sapiens (Human)
Description:
O14965
Residue:
403
  
Inhibitor
Name:
BDBM50193017
Synonyms:
CHEMBL3904942 | US11155556, No. 17
Type:
Small organic molecule
Emp. Form.:
C19H18N6O3S
Mol. Mass.:
410.45
SMILES:
CN1c2ccccc2C(=O)N(C)c2cnc(Nc3cccc(c3)S(N)(=O)=O)nc12
: