Target
NAD-dependent protein deacetylase sirtuin-1
Ligand
BDBM50193045
Substrate
Meas. Tech.
ChEMBL_1614274 (CHEMBL3856343)
IC50
110±n/a nM
Citation
 Kumar, AChauhan, S How much successful are the medicinal chemists in modulation of SIRT1: A critical review. Eur J Med Chem 119:45-69 (2016)  
Target
Name:
NAD-dependent protein deacetylase sirtuin-1
Synonyms:
NAD-Dependent Deacetylase Sirtuin-1 NAD-dependent protein deacetylase sirtuin-1 (SIRT1) SIR2-like protein 1 SIRT1 Sirtuin-1 (SIRT1) | hSIR2
Type:
Developmental protein; hydrolase
Mol. Mass.:
81626.66
Organism:
Homo sapiens (Human)
Description:
Residue:
747
  
Inhibitor
Name:
BDBM50193045
Synonyms:
CHEMBL3986181
Type:
Small organic molecule
Emp. Form.:
C11H15N5O2
Mol. Mass.:
249.2691
SMILES:
CCCCc1nn(C)c2nc(=O)n(C)c(=O)c2n1
: