Target
NAD-dependent protein deacetylase sirtuin-2
Ligand
BDBM50193043
Substrate
Meas. Tech.
ChEMBL_1614251 (CHEMBL3856320)
IC50
<20300±n/a nM
Citation
 Kumar, AChauhan, S How much successful are the medicinal chemists in modulation of SIRT1: A critical review. Eur J Med Chem 119:45-69 (2016)  
Target
Name:
NAD-dependent protein deacetylase sirtuin-2
Synonyms:
NAD-Dependent Deacetylase Sirtuin-2 NAD-dependent deacetylase sirtuin 3 SIR2-like SIR2L SIR2_HUMAN Sirtuin 2 (SIRT2)
Type:
Hydrolase
Mol. Mass.:
43172.62
Organism:
Homo sapiens (Human)
Description:
Residue:
389
  
Inhibitor
Name:
BDBM50193043
Synonyms:
CHEMBL3920465
Type:
Small organic molecule
Emp. Form.:
C14H10N2O2S
Mol. Mass.:
270.306
SMILES:
O=C1CC(=S)NC(=O)\C1=C\c1cc2ccccc2[nH]1
: