Target
NAD-dependent protein deacetylase sirtuin-2
Ligand
BDBM50193045
Substrate
Meas. Tech.
ChEMBL_1614275 (CHEMBL3856344)
IC50
>100000±n/a nM
Citation
 Kumar, AChauhan, S How much successful are the medicinal chemists in modulation of SIRT1: A critical review. Eur J Med Chem 119:45-69 (2016)  
Target
Name:
NAD-dependent protein deacetylase sirtuin-2
Synonyms:
NAD-Dependent Deacetylase Sirtuin-2 NAD-dependent deacetylase sirtuin 3 SIR2-like SIR2L SIR2_HUMAN Sirtuin 2 (SIRT2)
Type:
Hydrolase
Mol. Mass.:
43172.62
Organism:
Homo sapiens (Human)
Description:
Residue:
389
  
Inhibitor
Name:
BDBM50193045
Synonyms:
CHEMBL3986181
Type:
Small organic molecule
Emp. Form.:
C11H15N5O2
Mol. Mass.:
249.2691
SMILES:
CCCCc1nn(C)c2nc(=O)n(C)c(=O)c2n1
: