Target
NAD-dependent protein deacetylase sirtuin-2
Ligand
BDBM99917
Substrate
Meas. Tech.
ChEMBL_1614272 (CHEMBL3856341)
IC50
10000±n/a nM
Citation
 Kumar, AChauhan, S How much successful are the medicinal chemists in modulation of SIRT1: A critical review. Eur J Med Chem 119:45-69 (2016)  
Target
Name:
NAD-dependent protein deacetylase sirtuin-2
Synonyms:
NAD-Dependent Deacetylase Sirtuin-2 NAD-dependent deacetylase sirtuin 3 SIR2-like SIR2L SIR2_HUMAN Sirtuin 2 (SIRT2)
Type:
Hydrolase
Mol. Mass.:
43172.62
Organism:
Homo sapiens (Human)
Description:
Residue:
389
  
Inhibitor
Name:
BDBM99917
Synonyms:
4-tert-butyl-N-(4-(5-(dimethylamino)pentanamido)phenylcarbamothioyl)benzamide | US8501991, Tenovin 6
Type:
Small organic molecule
Emp. Form.:
C25H34N4O2S
Mol. Mass.:
454.628
SMILES:
CN(C)CCCCC(=O)Nc1ccc(NC(=S)NC(=O)c2ccc(cc2)C(C)(C)C)cc1
: