Target
Acetylcholinesterase
Ligand
BDBM50194795
Substrate
Meas. Tech.
ChEMBL_1617080 (CHEMBL3859149)
IC50
31±n/a nM
Citation
 Sola, IArtigas, ATaylor, MCPérez-Areales, FJViayna, EClos, MVPérez, BWright, CWKelly, JMMuñoz-Torrero, D Synthesis and biological evaluation of N-cyanoalkyl-, N-aminoalkyl-, and N-guanidinoalkyl-substituted 4-aminoquinoline derivatives as potent, selective, brain permeable antitrypanosomal agents. Bioorg Med Chem 24:5162-5171 (2016)  
Target
Name:
Acetylcholinesterase
Synonyms:
ACES_ELEEL Acetylcholinesterase (EeAChE) | ache
Type:
Enzyme
Mol. Mass.:
71812.79
Organism:
Electrophorus electricus (Electric eel)
Description:
Residue:
633
  
Inhibitor
Name:
BDBM50194795
Synonyms:
CHEMBL3945505
Type:
Small organic molecule
Emp. Form.:
C23H35N5
Mol. Mass.:
381.5575
SMILES:
NC(=N)NCCCCCCCCCNc1c2CCCCc2nc2ccccc12
: