Target
Proteasome subunit beta type-5
Ligand
BDBM50195938
Substrate
Meas. Tech.
ChEMBL_1618119 (CHEMBL3860288)
Ki
10980±n/a nM
Citation
 Di Giovanni, CEttari, RSarno, SRotondo, ABitto, ASquadrito, FAltavilla, DSchirmeister, TNovellino, EGrasso, SZappalą, MLavecchia, A Identification of noncovalent proteasome inhibitors with high selectivity for chymotrypsin-like activity by a multistep structure-based virtual screening. Eur J Med Chem 121:578-591 (2016)  
Target
Name:
Proteasome subunit beta type-5
Synonyms:
20S proteasome chymotrypsin-like LMPX PSB5_HUMAN Proteasome Macropain subunit MB1 X
Type:
Protein
Mol. Mass.:
28480.96
Organism:
Homo sapiens (Human)
Description:
Residue:
263
  
Inhibitor
Name:
BDBM50195938
Synonyms:
CHEMBL3961750
Type:
Small organic molecule
Emp. Form.:
C26H35N5O7
Mol. Mass.:
529.5854
SMILES:
CC(C)C[C@H](NC(=O)[C@H](CO)NC(=O)OCc1ccccc1)C(=O)N[C@@H](Cc1ccc(O)cc1)C(=O)NN
: