Target
Potassium channel subfamily K member 18
Ligand
BDBM17636
Substrate
Meas. Tech.
ChEMBL_1619068 (CHEMBL3861237)
EC50
474000±n/a nM
Citation
 Monteillier, ALoucif, AOmoto, KStevens, EBLainez, SSaintot, PPCao, LPryde, DC Investigation of the structure activity relationship of flufenamic acid derivatives at the human TRESK channel K Bioorg Med Chem Lett 26:4919-4924 (2016)  
Target
Name:
Potassium channel subfamily K member 18
Synonyms:
KCNK18 Potassium channel subfamily K member 18 TRIK TWIK-related spinal cord potassium channel
Type:
PROTEIN
Mol. Mass.:
43672.81
Organism:
Homo sapiens (Human)
Description:
ChEMBL_105638
Residue:
384
  
Inhibitor
Name:
BDBM17636
Synonyms:
2-{[3-(trifluoromethyl)phenyl]amino}benzoic acid CHEMBL23588 Nichisedan US9271961, Flufenamic Acid
Type:
Small organic molecule
Emp. Form.:
C14H10F3NO2
Mol. Mass.:
281.2299
SMILES:
OC(=O)c1ccccc1Nc1cccc(c1)C(F)(F)F
: