Target
Leukotriene A-4 hydrolase
Ligand
BDBM21642
Substrate
Meas. Tech.
ChEMBL_1619176 (CHEMBL3861345)
IC50
3600±n/a nM
Citation
 Wittmann, SKKalinowsky, LKramer, JSBloecher, RKnapp, SSteinhilber, DPogoryelov, DProschak, EHeering, J Thermodynamic properties of leukotriene A Bioorg Med Chem 24:5243-5248 (2016)  
Target
Name:
Leukotriene A-4 hydrolase
Synonyms:
LKHA4_HUMAN LTA4 Leukotriene A(4) hydrolase Leukotriene A4 hydrolase
Type:
Hydrolase; metalloprotease
Mol. Mass.:
69280.41
Organism:
Homo sapiens (Human)
Description:
Human recombinant LTA4H.
Residue:
611
  
Inhibitor
Name:
BDBM21642
Synonyms:
(2S)-1-[(2S)-2-methyl-3-sulfanylpropanoyl]pyrrolidine-2-carboxylic acid Capozide Lopirin SQ14534 | US11491146, Compound L-Captopril
Type:
Small organic molecule
Emp. Form.:
C9H15NO3S
Mol. Mass.:
217.285
SMILES:
C[C@H](CS)C(=O)N1CCC[C@H]1C(O)=O
: