Target
Protein-serine O-palmitoleoyltransferase porcupine
Ligand
BDBM50197279
Substrate
Meas. Tech.
ChEBML_1619372
IC50
130±n/a nM
Citation
 Xu, ZXu, XO'Laoi, RMa, HZheng, JChen, SLuo, LHu, ZHe, SLi, JZhang, HZhang, X Design, synthesis, and evaluation of novel porcupine inhibitors featuring a fused 3-ring system based on the 'reversed' amide scaffold. Bioorg Med Chem 24:5861-5872 (2016)  
Target
Name:
Protein-serine O-palmitoleoyltransferase porcupine
Synonyms:
PORCN_MOUSE Porcn Probable protein-cysteine N-palmitoyltransferase porcupine mPORC
Type:
PROTEIN
Mol. Mass.:
52528.36
Organism:
Mus musculus
Description:
ChEMBL_941167
Residue:
461
  
Inhibitor
Name:
BDBM50197279
Synonyms:
CHEMBL3914927
Type:
Small organic molecule
Emp. Form.:
C24H20N4O
Mol. Mass.:
380.4418
SMILES:
Cn1nccc1-c1ccc(CNC(=O)c2ccc3c(c2)[nH]c2ccccc32)cc1
: