Target
Aurora kinase B/Inner centromere protein
Ligand
BDBM50198082
Substrate
Meas. Tech.
ChEMBL_1620442 (CHEMBL3862725)
IC50
1540±n/a nM
Citation
 Kilchmann, FMarcaida, MJKotak, SSchick, TBoss, SDAwale, MGönczy, PReymond, JL Discovery of a Selective Aurora A Kinase Inhibitor by Virtual Screening. J Med Chem 59:7188-211 (2016)  
Target
Name:
Aurora kinase B/Inner centromere protein
Synonyms:
Aurora B/Incenp
Type:
Protein Complex
Mol. Mass.:
Description:
Components:
This complex has 2 components.
Component 1
Name:
Aurora kinase B
Synonyms:
AIK2 AIM1 ARK2 AURKB_HUMAN Aurora B-INCENP Aurora kinase B (AURKB) STK-1 STK12 Serine/threonine-protein kinase aurora B
Type:
Protein
Mol. Mass.:
39327.72
Organism:
Homo sapiens (Human)
Description:
Q96GD4
Residue:
344
  
Component 2
Name:
Inner centromere protein
Synonyms:
INCENP | INCE_HUMAN
Type:
Protein
Mol. Mass.:
105461.33
Organism:
Homo sapiens (Human)
Description:
Q9NQS7
Residue:
918
  
Inhibitor
Name:
BDBM50198082
Synonyms:
CHEMBL3904239
Type:
Small organic molecule
Emp. Form.:
C25H22N4O3S
Mol. Mass.:
458.532
SMILES:
CCc1ccc(cc1)\N=C1/S\C(=C/c2ccnc(Nc3ccc(cc3)C(O)=O)c2)C(=O)N1C
: