Target
Cytochrome P450 3A4
Ligand
BDBM50198325
Substrate
Meas. Tech.
ChEMBL_1620544 (CHEMBL3862827)
EC50
2000±n/a nM
Citation
 Sun, LQMull, EZheng, BD'Andrea, SZhao, QWang, AXSin, NVenables, BLSit, SYChen, YChen, JCocuzza, ABilder, DMMathur, ARampulla, RChen, BCPalani, TGanesan, SArunachalam, PNFalk, PLevine, SChen, CFriborg, JYu, FHernandez, DSheaffer, AKKnipe, JOHan, YHSchartman, RDonoso, MMosure, KSinz, MWZvyaga, TRajamani, RKish, KTredup, JKlei, HEGao, QNg, AMueller, LGrasela, DMAdams, SLoy, JLevesque, PCSun, HShi, HSun, LWarner, WLi, DZhu, JWang, YKFang, HCockett, MIMeanwell, NAMcPhee, FScola, PM Discovery of a Potent Acyclic, Tripeptidic, Acyl Sulfonamide Inhibitor of Hepatitis C Virus NS3 Protease as a Back-up to Asunaprevir with the Potential for Once-Daily Dosing. J Med Chem 59:8042-60 (2016)  
Target
Name:
Cytochrome P450 3A4
Synonyms:
Albendazole monooxygenase CP3A4_HUMAN CYP3A4 CYPIIIA4 Cytochrome P450 3A4 (CYP3A4) Nifedipine oxidase Taurochenodeoxycholate 6-alpha-hydroxylase
Type:
Enzyme
Mol. Mass.:
57349.57
Organism:
Homo sapiens (Human)
Description:
Residue:
503
  
Inhibitor
Name:
BDBM50198325
Synonyms:
CHEMBL3941014
Type:
Small organic molecule
Emp. Form.:
C38H48ClN5O9S
Mol. Mass.:
786.334
SMILES:
[H][C@@]12C[C@]1([H])C[C@@H](C2)OC(=O)N[C@H](C(=O)N1C[C@@H](C[C@H]1C(=O)N[C@@]1(C[C@H]1C1CC1)C(=O)NS(=O)(=O)C1CC1)Oc1ncc(OC)c2ccc(Cl)cc12)C(C)(C)C
: