Target
Alpha-1A adrenergic receptor
Ligand
BDBM50198639
Substrate
Meas. Tech.
ChEMBL_1620800 (CHEMBL3863083)
EC50
34±n/a nM
Citation
 Rak, ACanale, VMarciniec, KZmudzki, PKotanska, MKnutelska, JSiwek, AStachowicz, GBednarski, MNowinski, LZygmunt, MZajdel, PSapa, J Arylsulfonamide derivatives of (aryloxy)ethyl pyrrolidines and piperidines asa Bioorg Med Chem 24:5582-5591 (2016)  
Target
Name:
Alpha-1A adrenergic receptor
Synonyms:
ADA1A_HUMAN ADRA1C Alpha 1A-adrenoceptor Alpha adrenergic receptor 1a Alpha-adrenergic receptor 1c adrenergic Alpha1 | adrenergic Alpha1C
Type:
Cell-surface receptors
Mol. Mass.:
51511.67
Organism:
Homo sapiens (Human)
Description:
P35348
Residue:
466
  
Inhibitor
Name:
BDBM50198639
Synonyms:
CHEMBL3894175
Type:
Small organic molecule
Emp. Form.:
C26H33N3O4S
Mol. Mass.:
483.623
SMILES:
CC(C)Oc1ccccc1OCCN1CCC(CNS(=O)(=O)c2cccc3cccnc23)CC1
: