Target
Alpha-1A adrenergic receptor
Ligand
BDBM50198647
Substrate
Meas. Tech.
ChEMBL_1620800 (CHEMBL3863083)
EC50
161±n/a nM
Citation
 Rak, ACanale, VMarciniec, KZmudzki, PKotanska, MKnutelska, JSiwek, AStachowicz, GBednarski, MNowinski, LZygmunt, MZajdel, PSapa, J Arylsulfonamide derivatives of (aryloxy)ethyl pyrrolidines and piperidines asa Bioorg Med Chem 24:5582-5591 (2016)  
Target
Name:
Alpha-1A adrenergic receptor
Synonyms:
ADA1A_HUMAN ADRA1C Alpha 1A-adrenoceptor Alpha adrenergic receptor 1a Alpha-adrenergic receptor 1c adrenergic Alpha1 | adrenergic Alpha1C
Type:
Cell-surface receptors
Mol. Mass.:
51511.67
Organism:
Homo sapiens (Human)
Description:
P35348
Residue:
466
  
Inhibitor
Name:
BDBM50198647
Synonyms:
CHEMBL3968662
Type:
Small organic molecule
Emp. Form.:
C23H32N2O6S
Mol. Mass.:
464.575
SMILES:
COc1ccc(cc1OC)S(=O)(=O)NCC1CCN(CCOc2ccccc2OC)CC1
: