Target
Alpha-1B adrenergic receptor
Ligand
BDBM50198646
Substrate
Meas. Tech.
ChEMBL_1620802 (CHEMBL3863085)
EC50
515±n/a nM
Citation
 Rak, ACanale, VMarciniec, KZmudzki, PKotanska, MKnutelska, JSiwek, AStachowicz, GBednarski, MNowinski, LZygmunt, MZajdel, PSapa, J Arylsulfonamide derivatives of (aryloxy)ethyl pyrrolidines and piperidines asa Bioorg Med Chem 24:5582-5591 (2016)  
Target
Name:
Alpha-1B adrenergic receptor
Synonyms:
ADA1B_HUMAN Adrenergic alpha1B Adrenergic receptor alpha Alpha 1B-adrenoreceptor | Alpha-1B adrenergic receptor
Type:
Enzyme
Mol. Mass.:
56862.13
Organism:
Homo sapiens (Human)
Description:
P35368
Residue:
520
  
Inhibitor
Name:
BDBM50198646
Synonyms:
CHEMBL3986337
Type:
Small organic molecule
Emp. Form.:
C24H29N3O4S
Mol. Mass.:
455.57
SMILES:
COc1ccccc1OCCN1CCC(CNS(=O)(=O)c2cncc3ccccc23)CC1
: