Target
CDGSH iron-sulfur domain-containing protein 1
Ligand
BDBM50030474
Substrate
Meas. Tech.
ChEMBL_1620948 (CHEMBL3863231)
Ki
31±n/a nM
Citation
 Geldenhuys, WJYonutas, HMMorris, DLSullivan, PGDarvesh, ASLeeper, TC Identification of small molecules that bind to the mitochondrial protein mitoNEET. Bioorg Med Chem Lett 26:5350-5353 (2016)  
Target
Name:
CDGSH iron-sulfur domain-containing protein 1
Synonyms:
C10orf70 CISD1_HUMAN ZCD1
Type:
PROTEIN
Mol. Mass.:
12206.48
Organism:
Homo sapiens (Human)
Description:
ChEMBL_766432
Residue:
108
  
Inhibitor
Name:
BDBM50030474
Synonyms:
Avandamet Avandia CHEBI:50122 US10744117, Compound Rosiglitazone | US9562012, rosiglitazone
Type:
Small organic molecule
Emp. Form.:
C18H19N3O3S
Mol. Mass.:
357.427
SMILES:
CN(CCOc1ccc(CC2SC(=O)NC2=O)cc1)c1ccccn1
: