Target
5-hydroxytryptamine receptor 2A
Ligand
BDBM50199466
Substrate
Meas. Tech.
ChEMBL_1621629 (CHEMBL3863912)
Ki
>10000±n/a nM
Citation
 Tosh, DKCiancetta, AWarnick, ECrane, SGao, ZGJacobson, KA Structure-Based Scaffold Repurposing for G Protein-Coupled Receptors: Transformation of Adenosine Derivatives into 5HT J Med Chem 59:11006-11026 (2016)  
Target
Name:
5-hydroxytryptamine receptor 2A
Synonyms:
5-HT-2 5-HT2A 5-hydroxytryptamine receptor 2A (5HT-2A) 5HT2A_HUMAN HTR2A | Serotonin receptor 2A
Type:
undefined
Mol. Mass.:
52607.65
Organism:
Homo sapiens (Human)
Description:
P28223
Residue:
471
  
Inhibitor
Name:
BDBM50199466
Synonyms:
CHEMBL3913293
Type:
Small organic molecule
Emp. Form.:
C23H30ClN7O4
Mol. Mass.:
503.982
SMILES:
[H][C@]12C[C@]1([C@@H](O)[C@@H](O)[C@@H]2n1cnc2c(NC(C3CC3)C3CC3)nc(Cl)nc12)C(=O)NCCNC(C)=O
: