Target
Adenosine receptor A2a
Ligand
BDBM50199462
Substrate
Meas. Tech.
ChEMBL_1621584 (CHEMBL3863867)
Ki
1570±n/a nM
Citation
 Tosh, DKCiancetta, AWarnick, ECrane, SGao, ZGJacobson, KA Structure-Based Scaffold Repurposing for G Protein-Coupled Receptors: Transformation of Adenosine Derivatives into 5HT J Med Chem 59:11006-11026 (2016)  
Target
Name:
Adenosine receptor A2a
Synonyms:
A2A adenosine receptor (hA2A) ADENOSINE A2 ADORA2 Adenosine A2A receptor (A2AAR)
Type:
G Protein-Coupled Receptor (GPCR)
Mol. Mass.:
44716.46
Organism:
Homo sapiens (Human)
Description:
P29274
Residue:
412
  
Inhibitor
Name:
BDBM50199462
Synonyms:
CHEMBL3955519
Type:
Small organic molecule
Emp. Form.:
C21H26ClN5O4
Mol. Mass.:
447.915
SMILES:
[H][C@]12C[C@]1([C@@H](O)[C@@H](O)[C@@H]2n1cnc2c(NC(C3CC3)C3CC3)nc(Cl)nc12)C(=O)OCC
: