Target
Transmembrane domain-containing protein TMIGD3
Ligand
BDBM50199453
Substrate
Meas. Tech.
ChEMBL_1621587 (CHEMBL3863870)
Ki
165±n/a nM
Citation
 Tosh, DKCiancetta, AWarnick, ECrane, SGao, ZGJacobson, KA Structure-Based Scaffold Repurposing for G Protein-Coupled Receptors: Transformation of Adenosine Derivatives into 5HT J Med Chem 59:11006-11026 (2016)  
Target
Name:
Transmembrane domain-containing protein TMIGD3
Synonyms:
TMIG3_HUMAN Transmembrane domain-containing protein TMIGD3
Type:
PROTEIN
Mol. Mass.:
30335.79
Organism:
Homo sapiens (Human)
Description:
ChEMBL_114868
Residue:
266
  
Inhibitor
Name:
BDBM50199453
Synonyms:
CHEMBL3914002
Type:
Small organic molecule
Emp. Form.:
C12H9Cl2N5
Mol. Mass.:
294.139
SMILES:
Clc1cccc(CNc2nc(Cl)nc3[nH]cnc23)c1
: