Target
Transmembrane domain-containing protein TMIGD3
Ligand
BDBM50199457
Substrate
Meas. Tech.
ChEMBL_1621587 (CHEMBL3863870)
Ki
160±n/a nM
Citation
 Tosh, DKCiancetta, AWarnick, ECrane, SGao, ZGJacobson, KA Structure-Based Scaffold Repurposing for G Protein-Coupled Receptors: Transformation of Adenosine Derivatives into 5HT J Med Chem 59:11006-11026 (2016)  
Target
Name:
Transmembrane domain-containing protein TMIGD3
Synonyms:
TMIG3_HUMAN Transmembrane domain-containing protein TMIGD3
Type:
PROTEIN
Mol. Mass.:
30335.79
Organism:
Homo sapiens (Human)
Description:
ChEMBL_114868
Residue:
266
  
Inhibitor
Name:
BDBM50199457
Synonyms:
CHEMBL3932820
Type:
Small organic molecule
Emp. Form.:
C18H24ClN5O3
Mol. Mass.:
393.868
SMILES:
[H][C@]12C[C@@]1(CO)[C@@H](O)[C@@H](O)[C@@H]2n1cnc2c(N[C@H](CC)C3CC3)nc(Cl)nc12
: