Target
5-hydroxytryptamine receptor 2B
Ligand
BDBM50199458
Substrate
Meas. Tech.
ChEMBL_1621577 (CHEMBL3863860)
Ki
4700±n/a nM
Citation
 Tosh, DKCiancetta, AWarnick, ECrane, SGao, ZGJacobson, KA Structure-Based Scaffold Repurposing for G Protein-Coupled Receptors: Transformation of Adenosine Derivatives into 5HT J Med Chem 59:11006-11026 (2016)  
Target
Name:
5-hydroxytryptamine receptor 2B
Synonyms:
5-HT-2B 5-hydroxytryptamine (serotonin) receptor 2B [Homo sapiens] 5-hydroxytryptamine receptor 2C (5HT2C) HTR2B Serotonin 2b (5-HT2b) receptor | Serotonin Receptor 2B
Type:
G Protein-Coupled Receptor (GPCR)
Mol. Mass.:
54312.47
Organism:
Homo sapiens (Human)
Description:
Receptor binding assays were performed using human clone stably expressed in CHO cells.
Residue:
481
  
Inhibitor
Name:
BDBM50199458
Synonyms:
CHEMBL3938006
Type:
Small organic molecule
Emp. Form.:
C14H16ClN5O4
Mol. Mass.:
353.761
SMILES:
[H][C@]12C[C@]1([C@@H](O)[C@@H](O)[C@@H]2n1cnc2c(nc(Cl)nc12)N(C)C)C(O)=O
: