Target
Shiga toxin subunit A
Ligand
BDBM50199483
Substrate
Meas. Tech.
ChEMBL_1621651 (CHEMBL3863934)
Ki
73780±n/a nM
Citation
 Chauhan, VChaudhary, DPathak, USaxena, NDhaked, RK In Silico Discovery and Validation of Amide Based Small Molecule Targeting the Enzymatic Site of Shiga Toxin. J Med Chem 59:10763-10773 (2016)  
Target
Name:
Shiga toxin subunit A
Synonyms:
STXA_SHIDY stxA
Type:
PROTEIN
Mol. Mass.:
34823.39
Organism:
Shigella dysenteriae
Description:
ChEMBL_116947
Residue:
315
  
Inhibitor
Name:
BDBM50199483
Synonyms:
CHEMBL3895016
Type:
Small organic molecule
Emp. Form.:
C14H22N2S
Mol. Mass.:
250.403
SMILES:
C(CSc1ccccc1)NCCN1CCCC1
: