Target
Voltage-dependent T-type calcium channel subunit alpha-1H
Ligand
BDBM50192668
Substrate
Meas. Tech.
ChEMBL_1622838 (CHEMBL3865190)
IC50
8.2±n/a nM
Citation
 Siegrist, RPozzi, DJacob, GTorrisi, CColas, KBraibant, BMawet, JPfeifer, Tde Kanter, RRoch, CKessler, MCorminboeuf, OBezençon, O Structure-Activity Relationship, Drug Metabolism and Pharmacokinetics Properties Optimization, and in Vivo Studies of New Brain Penetrant Triple T-Type Calcium Channel Blockers. J Med Chem 59:10661-10675 (2016)  
Target
Name:
Voltage-dependent T-type calcium channel subunit alpha-1H
Synonyms:
CAC1H_HUMAN Low-voltage-activated calcium channel alpha1 3.2 subunit Voltage-gated calcium channel voltage-dependent T-type calcium channel subunit alpha-1H isoform a
Type:
Enzyme Catalytic Domain
Mol. Mass.:
259187.68
Organism:
Homo sapiens (Human)
Description:
Calcium channel (Type T,L) 0 0::O95180
Residue:
2353
  
Inhibitor
Name:
BDBM50192668
Synonyms:
CHEMBL1684950
Type:
Small organic molecule
Emp. Form.:
C20H23F3N2O2
Mol. Mass.:
380.404
SMILES:
CC(C)c1ccc(CC(=O)N[C@H](C)c2ccc(OCC(F)(F)F)cn2)cc1
: